Target
Beta-lactamase
Ligand
BDBM66113
Substrate
Meas. Tech.
Epi-absorbance-based dose response assay for common IMP-1 and VIM-2 inhibitors: biochemical high throughput screening assay to identify inhibitors of VIM-2 metallo-beta-lactamase
IC50
62430±n/a nM
Citation
 PubChem, PC Epi-absorbance-based dose response assay for common IMP-1 and VIM-2 inhibitors: biochemical high throughput screening assay to identify inhibitors of VIM-2 metallo-beta-lactamase PubChem Bioassay (2010)[AID] 
Target
Name:
Beta-lactamase
Synonyms:
Beta lactamase
Type:
Enzyme Catalytic Domain
Mol. Mass.:
31513.38
Organism:
Pseudomonas aeruginosa
Description:
gi_114881106
Residue:
286
  
Inhibitor
Name:
BDBM66113
Synonyms:
4,7-Diphenyl-2-pyridin-4-yl-3a,4,7,7a-tetrahydro-isoindole-1,3-dione 4,7-diphenyl-2-pyridin-4-yl-3a,4,7,7a-tetrahydroisoindole-1,3-dione SMR000174860 | cid_3105141
Type:
Small organic molecule
Emp. Form.:
C25H20N2O2
Mol. Mass.:
380.4385
SMILES:
Oc1c2C(C=CC(c2c(O)n1-c1ccncc1)c1ccccc1)c1ccccc1
: