Target
Beta-lactamase
Ligand
BDBM55829
Substrate
Meas. Tech.
Epi-absorbance-based dose response assay for common IMP-1 and VIM-2 inhibitors: biochemical high throughput screening assay to identify inhibitors of VIM-2 metallo-beta-lactamase
IC50
2741±n/a nM
Citation
 PubChem, PC Epi-absorbance-based dose response assay for common IMP-1 and VIM-2 inhibitors: biochemical high throughput screening assay to identify inhibitors of VIM-2 metallo-beta-lactamase PubChem Bioassay (2010)[AID] 
Target
Name:
Beta-lactamase
Synonyms:
Beta lactamase
Type:
Enzyme Catalytic Domain
Mol. Mass.:
31513.38
Organism:
Pseudomonas aeruginosa
Description:
gi_114881106
Residue:
286
  
Inhibitor
Name:
BDBM55829
Synonyms:
2-(7-morpholin-4-yl-4,4a,5,6-tetrahydro-3H-naphthalen-2-ylidene)propanedinitrile 2-[7-(4-morpholinyl)-4,4a,5,6-tetrahydro-3H-naphthalen-2-ylidene]propanedinitrile SMR000347625 | cid_4208272
Type:
Small organic molecule
Emp. Form.:
C17H19N3O
Mol. Mass.:
281.3523
SMILES:
N#C\[#6](C#N)=[#6]-1/[#6]-[#6]-[#6]-2-[#6]-[#6]-[#6](=[#6]-[#6]-2=[#6]-1)-[#7]-1-[#6]-[#6]-[#8]-[#6]-[#6]-1
: