Target
Beta-lactamase
Ligand
BDBM66146
Substrate
Meas. Tech.
Epi-absorbance-based dose response assay for common IMP-1 and VIM-2 inhibitors: biochemical high throughput screening assay to identify inhibitors of VIM-2 metallo-beta-lactamase
IC50
33921±n/a nM
Citation
 PubChem, PC Epi-absorbance-based dose response assay for common IMP-1 and VIM-2 inhibitors: biochemical high throughput screening assay to identify inhibitors of VIM-2 metallo-beta-lactamase PubChem Bioassay (2010)[AID] 
Target
Name:
Beta-lactamase
Synonyms:
Beta lactamase
Type:
Enzyme Catalytic Domain
Mol. Mass.:
31513.38
Organism:
Pseudomonas aeruginosa
Description:
gi_114881106
Residue:
286
  
Inhibitor
Name:
BDBM66146
Synonyms:
MLS001158244 N-(3-imidazol-1-ylpropyl)-2-[4-(4-methoxyphenyl)-8-methyl-2-oxidanylidene-chromen-7-yl]oxy-ethanamide N-[3-(1-imidazolyl)propyl]-2-[[4-(4-methoxyphenyl)-8-methyl-2-oxo-1-benzopyran-7-yl]oxy]acetamide cid_4837635
Type:
Small organic molecule
Emp. Form.:
C25H25N3O5
Mol. Mass.:
447.4831
SMILES:
COc1ccc(cc1)-c1cc(=O)oc2c(C)c(OCC(=O)NCCCn3ccnc3)ccc12
: