Target
Beta-lactamase
Ligand
BDBM66114
Substrate
Meas. Tech.
Epi-absorbance-based dose response assay for common IMP-1 and VIM-2 inhibitors: biochemical high throughput counterscreen to identify inhibitors of TEM-1 metallo-beta-lactamase
IC50
>59640±n/a nM
Citation
 PubChem, PC Epi-absorbance-based dose response assay for common IMP-1 and VIM-2 inhibitors: biochemical high throughput counterscreen to identify inhibitors of TEM-1 metallo-beta-lactamase PubChem Bioassay (2010)[AID] 
Target
Name:
Beta-lactamase
Synonyms:
Type:
Enzyme Catalytic Domain
Mol. Mass.:
29494.42
Organism:
Salmonella enterica subsp. enterica serovar Choleraesuis str. SC-B67
Description:
gi_60115532
Residue:
269
  
Inhibitor
Name:
BDBM66114
Synonyms:
4,7-Diphenyl-2-pyridin-2-yl-3a,4,7,7a-tetrahydro-isoindole-1,3-dione 4,7-diphenyl-2-(2-pyridyl)-3a,4,7,7a-tetrahydroisoindole-1,3-quinone MLS000567438 cid_3105140
Type:
Small organic molecule
Emp. Form.:
C25H20N2O2
Mol. Mass.:
380.4385
SMILES:
Oc1c2C(C=CC(c2c(O)n1-c1ccccn1)c1ccccc1)c1ccccc1
: