Target
Beta-lactamase
Ligand
BDBM51078
Substrate
Meas. Tech.
Epi-absorbance-based dose response assay for common IMP-1 and VIM-2 inhibitors: biochemical high throughput counterscreen to identify inhibitors of TEM-1 metallo-beta-lactamase
IC50
5251±n/a nM
Citation
 PubChem, PC Epi-absorbance-based dose response assay for common IMP-1 and VIM-2 inhibitors: biochemical high throughput counterscreen to identify inhibitors of TEM-1 metallo-beta-lactamase PubChem Bioassay (2010)[AID] 
Target
Name:
Beta-lactamase
Synonyms:
Type:
Enzyme Catalytic Domain
Mol. Mass.:
29494.42
Organism:
Salmonella enterica subsp. enterica serovar Choleraesuis str. SC-B67
Description:
gi_60115532
Residue:
269
  
Inhibitor
Name:
BDBM51078
Synonyms:
6-amino-2-(1,3,5-trimethyl-1H-pyrazol-4-yl)-1H-benzo[de]isoquinoline-1,3(2H)-dione 6-amino-2-(1,3,5-trimethylpyrazol-4-yl)benzo[de]isoquinoline-1,3-dione 6-azanyl-2-(1,3,5-trimethylpyrazol-4-yl)benzo[de]isoquinoline-1,3-dione SMR000227538 | cid_839988
Type:
Small organic molecule
Emp. Form.:
C18H16N4O2
Mol. Mass.:
320.3452
SMILES:
Cc1nn(C)c(C)c1N1C(=O)c2cccc3c(N)ccc(C1=O)c23
: