Target
Beta-lactamase
Ligand
BDBM66115
Substrate
Meas. Tech.
Epi-absorbance-based dose response assay for common IMP-1 and VIM-2 inhibitors: biochemical high throughput counterscreen to identify inhibitors of TEM-1 metallo-beta-lactamase
IC50
1043±n/a nM
Citation
 PubChem, PC Epi-absorbance-based dose response assay for common IMP-1 and VIM-2 inhibitors: biochemical high throughput counterscreen to identify inhibitors of TEM-1 metallo-beta-lactamase PubChem Bioassay (2010)[AID] 
Target
Name:
Beta-lactamase
Synonyms:
Type:
Enzyme Catalytic Domain
Mol. Mass.:
29494.42
Organism:
Salmonella enterica subsp. enterica serovar Choleraesuis str. SC-B67
Description:
gi_60115532
Residue:
269
  
Inhibitor
Name:
BDBM66115
Synonyms:
2-[7-(1-azepanyl)-4,4a,5,6-tetrahydro-3H-naphthalen-2-ylidene]propanedinitrile 2-[7-(azepan-1-yl)-4,4a,5,6-tetrahydro-3H-naphthalen-2-ylidene]propanedinitrile SMR000260963 | cid_3614365
Type:
Small organic molecule
Emp. Form.:
C19H23N3
Mol. Mass.:
293.406
SMILES:
N#C\[#6](C#N)=[#6]-1/[#6]-[#6]-[#6]-2-[#6]-[#6]-[#6](=[#6]-[#6]-2=[#6]-1)-[#7]-1-[#6]-[#6]-[#6]-[#6]-[#6]-[#6]-1
: