Target
Beta-lactamase
Ligand
BDBM66117
Substrate
Meas. Tech.
Epi-absorbance-based dose response assay for common IMP-1 and VIM-2 inhibitors: biochemical high throughput counterscreen to identify inhibitors of TEM-1 metallo-beta-lactamase
IC50
6086±n/a nM
Citation
 PubChem, PC Epi-absorbance-based dose response assay for common IMP-1 and VIM-2 inhibitors: biochemical high throughput counterscreen to identify inhibitors of TEM-1 metallo-beta-lactamase PubChem Bioassay (2010)[AID] 
Target
Name:
Beta-lactamase
Synonyms:
Type:
Enzyme Catalytic Domain
Mol. Mass.:
29494.42
Organism:
Salmonella enterica subsp. enterica serovar Choleraesuis str. SC-B67
Description:
gi_60115532
Residue:
269
  
Inhibitor
Name:
BDBM66117
Synonyms:
(3Z)-3-[(2Z)-2-(1,3,3-trimethyl-2-indolylidene)ethylidene]-3,4-dihydro-2H-1-benzopyran-2,4-dione (3Z)-3-[(2Z)-2-(1,3,3-trimethylindolin-2-ylidene)ethylidene]chroman-2,4-quinone MLS000700052 cid_5568908
Type:
Small organic molecule
Emp. Form.:
C22H19NO3
Mol. Mass.:
345.3912
SMILES:
CN1\C(=C/C=C2\C(=O)Oc3ccccc3C2=O)C(C)(C)c2ccccc12
: