Target
Beta-lactamase
Ligand
BDBM66120
Substrate
Meas. Tech.
Epi-absorbance-based dose response assay for common IMP-1 and VIM-2 inhibitors: biochemical high throughput counterscreen to identify inhibitors of TEM-1 metallo-beta-lactamase
IC50
6739±n/a nM
Citation
 PubChem, PC Epi-absorbance-based dose response assay for common IMP-1 and VIM-2 inhibitors: biochemical high throughput counterscreen to identify inhibitors of TEM-1 metallo-beta-lactamase PubChem Bioassay (2010)[AID] 
Target
Name:
Beta-lactamase
Synonyms:
Type:
Enzyme Catalytic Domain
Mol. Mass.:
29494.42
Organism:
Salmonella enterica subsp. enterica serovar Choleraesuis str. SC-B67
Description:
gi_60115532
Residue:
269
  
Inhibitor
Name:
BDBM66120
Synonyms:
2-[5-[(E)-2-[2-keto-6-(trifluoromethyl)-1H-pyrimidin-4-yl]vinyl]-2-furyl]benzoic acid 2-[5-[(E)-2-[2-oxo-6-(trifluoromethyl)-1H-pyrimidin-4-yl]ethenyl]-2-furanyl]benzoic acid MLS000715904 cid_5765499
Type:
Small organic molecule
Emp. Form.:
C18H11F3N2O4
Mol. Mass.:
376.2861
SMILES:
OC(=O)c1ccccc1-c1ccc(C=Cc2cc(nc(=O)[nH]2)C(F)(F)F)o1
: