Target
Beta-lactamase
Ligand
BDBM51165
Substrate
Meas. Tech.
Epi-absorbance-based dose response assay for common IMP-1 and VIM-2 inhibitors: biochemical high throughput screening assay to identify inhibitors of IMP-1metallo-beta-lactamase
IC50
12722±n/a nM
Citation
 PubChem, PC Epi-absorbance-based dose response assay for common IMP-1 and VIM-2 inhibitors: biochemical high throughput screening assay to identify inhibitors of IMP-1metallo-beta-lactamase PubChem Bioassay (2010)[AID] 
Target
Name:
Beta-lactamase
Synonyms:
Beta-lactamase | metallo-beta-lactamase IMP-1
Type:
Enzyme Catalytic Domain
Mol. Mass.:
27125.88
Organism:
Pseudomonas aeruginosa
Description:
gi_27368096
Residue:
246
  
Inhibitor
Name:
BDBM51165
Synonyms:
6-amino-2-phenyl-benzo[de]isoquinoline-1,3-quinone 6-azanyl-2-phenyl-benzo[de]isoquinoline-1,3-dione SMR000279329 | cid_202512
Type:
Small organic molecule
Emp. Form.:
C18H12N2O2
Mol. Mass.:
288.3001
SMILES:
Nc1ccc2C(=O)N(C(=O)c3cccc1c23)c1ccccc1
: