Target
Beta-lactamase
Ligand
BDBM53032
Substrate
Meas. Tech.
Epi-absorbance-based dose response assay for common IMP-1 and VIM-2 inhibitors: biochemical high throughput screening assay to identify inhibitors of IMP-1metallo-beta-lactamase
IC50
>59640±n/a nM
Citation
 PubChem, PC Epi-absorbance-based dose response assay for common IMP-1 and VIM-2 inhibitors: biochemical high throughput screening assay to identify inhibitors of IMP-1metallo-beta-lactamase PubChem Bioassay (2010)[AID] 
Target
Name:
Beta-lactamase
Synonyms:
Beta-lactamase | metallo-beta-lactamase IMP-1
Type:
Enzyme Catalytic Domain
Mol. Mass.:
27125.88
Organism:
Pseudomonas aeruginosa
Description:
gi_27368096
Residue:
246
  
Inhibitor
Name:
BDBM53032
Synonyms:
(5E)-5-[4-(dimethylamino)benzylidene]-3-methyl-2-thioxo-oxazolidin-4-one (5E)-5-[[4-(dimethylamino)phenyl]methylidene]-3-methyl-2-sulfanylidene-4-oxazolidinone MLS001008595 cid_2259994
Type:
Small organic molecule
Emp. Form.:
C13H14N2O2S
Mol. Mass.:
262.327
SMILES:
CN(C)c1ccc(\C=C2\OC(=S)N(C)C2=O)cc1
: