Target
Beta-lactamase
Ligand
BDBM61733
Substrate
Meas. Tech.
Epi-absorbance-based dose response assay for common IMP-1 and VIM-2 inhibitors: biochemical high throughput screening assay to identify inhibitors of IMP-1metallo-beta-lactamase
IC50
>59640±n/a nM
Citation
 PubChem, PC Epi-absorbance-based dose response assay for common IMP-1 and VIM-2 inhibitors: biochemical high throughput screening assay to identify inhibitors of IMP-1metallo-beta-lactamase PubChem Bioassay (2010)[AID] 
Target
Name:
Beta-lactamase
Synonyms:
Beta-lactamase | metallo-beta-lactamase IMP-1
Type:
Enzyme Catalytic Domain
Mol. Mass.:
27125.88
Organism:
Pseudomonas aeruginosa
Description:
gi_27368096
Residue:
246
  
Inhibitor
Name:
BDBM61733
Synonyms:
2-chloranyl-5-[2-[(1-propan-2-ylindol-3-yl)methylidene]hydrazinyl]benzoic acid 2-chloro-5-[2-[(1-propan-2-ylindol-3-yl)methylidene]hydrazinyl]benzoic acid MLS001183676 cid_4373715
Type:
Small organic molecule
Emp. Form.:
C19H18ClN3O2
Mol. Mass.:
355.818
SMILES:
CC(C)n1cc(CN=Nc2ccc(Cl)c(c2)C(O)=O)c2ccccc12
: