Target
Beta-lactamase
Ligand
BDBM66150
Substrate
Meas. Tech.
Epi-absorbance-based dose response assay for common IMP-1 and VIM-2 inhibitors: biochemical high throughput screening assay to identify inhibitors of IMP-1metallo-beta-lactamase
IC50
>59640±n/a nM
Citation
 PubChem, PC Epi-absorbance-based dose response assay for common IMP-1 and VIM-2 inhibitors: biochemical high throughput screening assay to identify inhibitors of IMP-1metallo-beta-lactamase PubChem Bioassay (2010)[AID] 
Target
Name:
Beta-lactamase
Synonyms:
Beta-lactamase | metallo-beta-lactamase IMP-1
Type:
Enzyme Catalytic Domain
Mol. Mass.:
27125.88
Organism:
Pseudomonas aeruginosa
Description:
gi_27368096
Residue:
246
  
Inhibitor
Name:
BDBM66150
Synonyms:
3-[(5Z)-5-(4-chlorobenzylidene)-4-keto-2-thioxo-thiazolidin-3-yl]-N-(3-imidazol-1-ylpropyl)propionamide 3-[(5Z)-5-[(4-chlorophenyl)methylidene]-4-oxo-2-sulfanylidene-1,3-thiazolidin-3-yl]-N-(3-imidazol-1-ylpropyl)propanamide MLS001160111 cid_6226036
Type:
Small organic molecule
Emp. Form.:
C19H19ClN4O2S2
Mol. Mass.:
434.963
SMILES:
Clc1ccc(\C=C2/SC(=S)N(CCC(=O)NCCCn3ccnc3)C2=O)cc1
: