Target
Photoreceptor-specific nuclear receptor
Ligand
BDBM66156
Substrate
Meas. Tech.
TR-FRET-based biochemical high throughput dose response assay for agonists of nuclear receptor subfamily 2, group E, member 3 (NR2E3)
IC50
>39841±n/a nM
Citation
 PubChem, PC TR-FRET-based biochemical high throughput dose response assay for agonists of nuclear receptor subfamily 2, group E, member 3 (NR2E3) PubChem Bioassay (2010)[AID] 
Target
Name:
Photoreceptor-specific nuclear receptor
Synonyms:
NR2E3 PNR photoreceptor-specific nuclear receptor
Type:
PROTEIN
Mol. Mass.:
44699.83
Organism:
Homo sapiens (Human)
Description:
ChEMBL_401901
Residue:
410
  
Inhibitor
Name:
BDBM66156
Synonyms:
3-(1-benzofuran-2-carbonyl)-4-hydroxy-1-(2-morpholin-4-ylethyl)-2-thiophen-2-yl-2H-pyrrol-5-one 3-[2-benzofuranyl(oxo)methyl]-4-hydroxy-1-[2-(4-morpholinyl)ethyl]-2-thiophen-2-yl-2H-pyrrol-5-one MLS000081299 cid_664584
Type:
Small organic molecule
Emp. Form.:
C23H22N2O5S
Mol. Mass.:
438.496
SMILES:
O=C(C1C(N(CCN2CCOCC2)C(=O)C1=O)c1cccs1)c1cc2ccccc2o1
: