Target
Photoreceptor-specific nuclear receptor
Ligand
BDBM42756
Substrate
Meas. Tech.
TR-FRET-based biochemical high throughput dose response assay for agonists of nuclear receptor subfamily 2, group E, member 3 (NR2E3)
IC50
>39841±n/a nM
Citation
 PubChem, PC TR-FRET-based biochemical high throughput dose response assay for agonists of nuclear receptor subfamily 2, group E, member 3 (NR2E3) PubChem Bioassay (2010)[AID] 
Target
Name:
Photoreceptor-specific nuclear receptor
Synonyms:
NR2E3 PNR photoreceptor-specific nuclear receptor
Type:
PROTEIN
Mol. Mass.:
44699.83
Organism:
Homo sapiens (Human)
Description:
ChEMBL_401901
Residue:
410
  
Inhibitor
Name:
BDBM42756
Synonyms:
2-(6-amino-3,5-dicyanopyridin-2-yl)sulfanyl-N-(2-ethoxyphenyl)acetamide 2-[(6-amino-3,5-dicyano-2-pyridinyl)thio]-N-(2-ethoxyphenyl)acetamide 2-[(6-amino-3,5-dicyanopyridin-2-yl)thio]-N-(2-ethoxyphenyl)acetamide SMR000020888 | cid_2868371
Type:
Small organic molecule
Emp. Form.:
C17H15N5O2S
Mol. Mass.:
353.398
SMILES:
CCOc1ccccc1NC(=O)CSc1nc(N)c(cc1C#N)C#N
: