Target
Photoreceptor-specific nuclear receptor
Ligand
BDBM40998
Substrate
Meas. Tech.
TR-FRET-based biochemical high throughput dose response assay for agonists of nuclear receptor subfamily 2, group E, member 3 (NR2E3)
IC50
>39841±n/a nM
Citation
 PubChem, PC TR-FRET-based biochemical high throughput dose response assay for agonists of nuclear receptor subfamily 2, group E, member 3 (NR2E3) PubChem Bioassay (2010)[AID] 
Target
Name:
Photoreceptor-specific nuclear receptor
Synonyms:
NR2E3 PNR photoreceptor-specific nuclear receptor
Type:
PROTEIN
Mol. Mass.:
44699.83
Organism:
Homo sapiens (Human)
Description:
ChEMBL_401901
Residue:
410
  
Inhibitor
Name:
BDBM40998
Synonyms:
MLS000108784 cid_1356461
Type:
Small organic molecule
Emp. Form.:
C25H19N3O3
Mol. Mass.:
409.4367
SMILES:
Cc1c(N2C(=O)c3ccc4CCc5ccc(C2=O)c3c45)c(=O)n(-c2ccccc2)n1C
: