Target
Photoreceptor-specific nuclear receptor
Ligand
BDBM66166
Substrate
Meas. Tech.
TR-FRET-based biochemical high throughput dose response assay for agonists of nuclear receptor subfamily 2, group E, member 3 (NR2E3)
IC50
>39841±n/a nM
Citation
 PubChem, PC TR-FRET-based biochemical high throughput dose response assay for agonists of nuclear receptor subfamily 2, group E, member 3 (NR2E3) PubChem Bioassay (2010)[AID] 
Target
Name:
Photoreceptor-specific nuclear receptor
Synonyms:
NR2E3 PNR photoreceptor-specific nuclear receptor
Type:
PROTEIN
Mol. Mass.:
44699.83
Organism:
Homo sapiens (Human)
Description:
ChEMBL_401901
Residue:
410
  
Inhibitor
Name:
BDBM66166
Synonyms:
2-(3-Ethyl-thioureido)-5,6,7,8-tetrahydro-quinoline-3-carboxylic acid ethyl ester 2-[[ethylamino(sulfanylidene)methyl]amino]-5,6,7,8-tetrahydroquinoline-3-carboxylic acid ethyl ester SMR000219774 ethyl 2-(ethylcarbamothioylamino)-5,6,7,8-tetrahydroquinoline-3-carboxylate
Type:
Small organic molecule
Emp. Form.:
C15H21N3O2S
Mol. Mass.:
307.411
SMILES:
CCNC(=S)Nc1nc2CCCCc2cc1C(=O)OCC
: