Target
Photoreceptor-specific nuclear receptor
Ligand
BDBM47284
Substrate
Meas. Tech.
TR-FRET-based biochemical high throughput dose response assay for agonists of nuclear receptor subfamily 2, group E, member 3 (NR2E3)
IC50
>39841±n/a nM
Citation
 PubChem, PC TR-FRET-based biochemical high throughput dose response assay for agonists of nuclear receptor subfamily 2, group E, member 3 (NR2E3) PubChem Bioassay (2010)[AID] 
Target
Name:
Photoreceptor-specific nuclear receptor
Synonyms:
NR2E3 PNR photoreceptor-specific nuclear receptor
Type:
PROTEIN
Mol. Mass.:
44699.83
Organism:
Homo sapiens (Human)
Description:
ChEMBL_401901
Residue:
410
  
Inhibitor
Name:
BDBM47284
Synonyms:
2-chloranyl-3-oxidanyl-benzo[c]chromen-6-one 2-chloro-3-hydroxy-6H-benzo[c]chromen-6-one 2-chloro-3-hydroxybenzo[c]chromen-6-one SMR000300153 | cid_5428505
Type:
Small organic molecule
Emp. Form.:
C13H7ClO3
Mol. Mass.:
246.646
SMILES:
Oc1cc2oc(=O)c3ccccc3c2cc1Cl
: