Target
Photoreceptor-specific nuclear receptor
Ligand
BDBM66176
Substrate
Meas. Tech.
TR-FRET-based biochemical high throughput dose response assay for agonists of nuclear receptor subfamily 2, group E, member 3 (NR2E3)
IC50
1636±n/a nM
Citation
 PubChem, PC TR-FRET-based biochemical high throughput dose response assay for agonists of nuclear receptor subfamily 2, group E, member 3 (NR2E3) PubChem Bioassay (2010)[AID] 
Target
Name:
Photoreceptor-specific nuclear receptor
Synonyms:
NR2E3 PNR photoreceptor-specific nuclear receptor
Type:
PROTEIN
Mol. Mass.:
44699.83
Organism:
Homo sapiens (Human)
Description:
ChEMBL_401901
Residue:
410
  
Inhibitor
Name:
BDBM66176
Synonyms:
MLS000727574 cid_23679856 potassium;6-bromo-2-(3-pyridinyl)-4-quinolinecarboxylate potassium;6-bromo-2-pyridin-3-ylquinoline-4-carboxylate
Type:
Small organic molecule
Emp. Form.:
C15H8BrN2O2
Mol. Mass.:
328.141
SMILES:
[O-]C(=O)c1cc(nc2ccc(Br)cc12)-c1cccnc1
: