Target
Photoreceptor-specific nuclear receptor
Ligand
BDBM57855
Substrate
Meas. Tech.
TR-FRET-based biochemical high throughput dose response assay for agonists of nuclear receptor subfamily 2, group E, member 3 (NR2E3)
IC50
>39841±n/a nM
Citation
 PubChem, PC TR-FRET-based biochemical high throughput dose response assay for agonists of nuclear receptor subfamily 2, group E, member 3 (NR2E3) PubChem Bioassay (2010)[AID] 
Target
Name:
Photoreceptor-specific nuclear receptor
Synonyms:
NR2E3 PNR photoreceptor-specific nuclear receptor
Type:
PROTEIN
Mol. Mass.:
44699.83
Organism:
Homo sapiens (Human)
Description:
ChEMBL_401901
Residue:
410
  
Inhibitor
Name:
BDBM57855
Synonyms:
2-(benzylthio)-1H-quinazoline-4-thione 2-(phenylmethylsulfanyl)-1H-quinazoline-4-thione 2-benzylsulfanyl-1H-quinazoline-4-thione SMR000269454 | cid_833786
Type:
Small organic molecule
Emp. Form.:
C15H12N2S2
Mol. Mass.:
284.399
SMILES:
S=c1[nH]c(SCc2ccccc2)nc2ccccc12
: