Target
Photoreceptor-specific nuclear receptor
Ligand
BDBM66187
Substrate
Meas. Tech.
TR-FRET-based biochemical high throughput dose response assay for agonists of nuclear receptor subfamily 2, group E, member 3 (NR2E3)
IC50
>1476±n/a nM
Citation
 PubChem, PC TR-FRET-based biochemical high throughput dose response assay for agonists of nuclear receptor subfamily 2, group E, member 3 (NR2E3) PubChem Bioassay (2010)[AID] 
Target
Name:
Photoreceptor-specific nuclear receptor
Synonyms:
NR2E3 PNR photoreceptor-specific nuclear receptor
Type:
PROTEIN
Mol. Mass.:
44699.83
Organism:
Homo sapiens (Human)
Description:
ChEMBL_401901
Residue:
410
  
Inhibitor
Name:
BDBM66187
Synonyms:
5,5-Dimethyl-2-thioxo-2,3,5,6-tetrahydro-1H-benzo[h]quinazolin-4-one 5,5-dimethyl-2-thioxo-1,6-dihydrobenzo[h]quinazolin-4-one SMR000505168 | cid_713572
Type:
Small organic molecule
Emp. Form.:
C14H14N2OS
Mol. Mass.:
258.339
SMILES:
CC1(C)Cc2ccccc2-c2[nH]c(=S)[nH]c(=O)c12
: