Target
Photoreceptor-specific nuclear receptor
Ligand
BDBM66201
Substrate
Meas. Tech.
TR-FRET-based biochemical high throughput dose response assay for agonists of nuclear receptor subfamily 2, group E, member 3 (NR2E3)
IC50
>39841±n/a nM
Citation
 PubChem, PC TR-FRET-based biochemical high throughput dose response assay for agonists of nuclear receptor subfamily 2, group E, member 3 (NR2E3) PubChem Bioassay (2010)[AID] 
Target
Name:
Photoreceptor-specific nuclear receptor
Synonyms:
NR2E3 PNR photoreceptor-specific nuclear receptor
Type:
PROTEIN
Mol. Mass.:
44699.83
Organism:
Homo sapiens (Human)
Description:
ChEMBL_401901
Residue:
410
  
Inhibitor
Name:
BDBM66201
Synonyms:
3-(2-chloranyl-6-fluoranyl-phenyl)-5-methyl-N-[5-(trifluoromethyl)-1,3,4-thiadiazol-2-yl]-1,2-oxazole-4-carboxamide 3-(2-chloro-6-fluorophenyl)-5-methyl-N-[5-(trifluoromethyl)-1,3,4-thiadiazol-2-yl]-1,2-oxazole-4-carboxamide MLS001035723 cid_1247739
Type:
Small organic molecule
Emp. Form.:
C14H7ClF4N4O2S
Mol. Mass.:
406.743
SMILES:
Cc1onc(c1C(=O)Nc1nnc(s1)C(F)(F)F)-c1c(F)cccc1Cl
: