Target
Photoreceptor-specific nuclear receptor
Ligand
BDBM66214
Substrate
Meas. Tech.
TR-FRET-based biochemical high throughput dose response assay for agonists of nuclear receptor subfamily 2, group E, member 3 (NR2E3)
IC50
>39841±n/a nM
Citation
 PubChem, PC TR-FRET-based biochemical high throughput dose response assay for agonists of nuclear receptor subfamily 2, group E, member 3 (NR2E3) PubChem Bioassay (2010)[AID] 
Target
Name:
Photoreceptor-specific nuclear receptor
Synonyms:
NR2E3 PNR photoreceptor-specific nuclear receptor
Type:
PROTEIN
Mol. Mass.:
44699.83
Organism:
Homo sapiens (Human)
Description:
ChEMBL_401901
Residue:
410
  
Inhibitor
Name:
BDBM66214
Synonyms:
3-(1-benzofuran-2-carbonyl)-4-hydroxy-2-(2-methoxyphenyl)-1-(5-methyl-1,2-oxazol-3-yl)-2H-pyrrol-5-one 3-[2-benzofuranyl(oxo)methyl]-4-hydroxy-2-(2-methoxyphenyl)-1-(5-methyl-3-isoxazolyl)-2H-pyrrol-5-one MLS001142991 cid_4295307
Type:
Small organic molecule
Emp. Form.:
C24H18N2O6
Mol. Mass.:
430.4095
SMILES:
COc1ccccc1C1C(C(=O)c2cc3ccccc3o2)C(=O)C(=O)N1c1cc(C)on1
: