Target
Isoform 2 of Nuclear receptor corepressor 2 (TRAC-1)
Ligand
BDBM41955
Substrate
Meas. Tech.
Counterscreen for agonists of nuclear receptor subfamily 2, group E, member 3 (NR2E3)
IC50
>39841±n/a nM
Citation
 PubChem, PC Counterscreen for agonists of nuclear receptor subfamily 2, group E, member 3 (NR2E3): TR-FRET-based biochemical high throughput dose response assay to identify agonists of the interaction between peroxisome proliferator-activated receptor gamma (PPARg) and nuclear receptor co-repressor 2 (NCOR2) PubChem Bioassay (2010)[AID] 
Target
Name:
Isoform 2 of Nuclear receptor corepressor 2 (TRAC-1)
Synonyms:
CTG26 NCOR2_HUMAN nuclear receptor corepressor 2 isoform 2
Type:
Enzyme Catalytic Domain
Mol. Mass.:
81401.89
Organism:
Homo sapiens (Human)
Description:
Q9Y618-2 gi_116256445
Residue:
766
  
Inhibitor
Name:
BDBM41955
Synonyms:
5-bromanyl-2-ethoxy-N-[4-(2-methylpropylcarbamoyl)phenyl]benzamide 5-bromo-2-ethoxy-N-[4-(isobutylcarbamoyl)phenyl]benzamide 5-bromo-2-ethoxy-N-{4-[(isobutylamino)carbonyl]phenyl}benzamide SMR000229312 | cid_1026561
Type:
Small organic molecule
Emp. Form.:
C20H23BrN2O3
Mol. Mass.:
419.312
SMILES:
CCOc1ccc(Br)cc1C(=O)Nc1ccc(cc1)C(=O)NCC(C)C
: