Target
Isoform 2 of Nuclear receptor corepressor 2 (TRAC-1)
Ligand
BDBM66190
Substrate
Meas. Tech.
Counterscreen for agonists of nuclear receptor subfamily 2, group E, member 3 (NR2E3)
IC50
3221±n/a nM
Citation
 PubChem, PC Counterscreen for agonists of nuclear receptor subfamily 2, group E, member 3 (NR2E3): TR-FRET-based biochemical high throughput dose response assay to identify agonists of the interaction between peroxisome proliferator-activated receptor gamma (PPARg) and nuclear receptor co-repressor 2 (NCOR2) PubChem Bioassay (2010)[AID] 
Target
Name:
Isoform 2 of Nuclear receptor corepressor 2 (TRAC-1)
Synonyms:
CTG26 NCOR2_HUMAN nuclear receptor corepressor 2 isoform 2
Type:
Enzyme Catalytic Domain
Mol. Mass.:
81401.89
Organism:
Homo sapiens (Human)
Description:
Q9Y618-2 gi_116256445
Residue:
766
  
Inhibitor
Name:
BDBM66190
Synonyms:
2-amino-6-(dicyanomethylene)-4-phenyl-1H-pyridine-3,5-dicarbonitrile 2-azanyl-6-(dicyanomethylidene)-4-phenyl-1H-pyridine-3,5-dicarbonitrile SMR000539348 | cid_910973
Type:
Small organic molecule
Emp. Form.:
C16H8N6
Mol. Mass.:
284.2749
SMILES:
Nc1nc(C(C#N)C#N)c(C#N)c(-c2ccccc2)c1C#N
: