Target
Isoform 2 of Nuclear receptor corepressor 2 (TRAC-1)
Ligand
BDBM66200
Substrate
Meas. Tech.
Counterscreen for agonists of nuclear receptor subfamily 2, group E, member 3 (NR2E3)
IC50
17751±n/a nM
Citation
 PubChem, PC Counterscreen for agonists of nuclear receptor subfamily 2, group E, member 3 (NR2E3): TR-FRET-based biochemical high throughput dose response assay to identify agonists of the interaction between peroxisome proliferator-activated receptor gamma (PPARg) and nuclear receptor co-repressor 2 (NCOR2) PubChem Bioassay (2010)[AID] 
Target
Name:
Isoform 2 of Nuclear receptor corepressor 2 (TRAC-1)
Synonyms:
CTG26 NCOR2_HUMAN nuclear receptor corepressor 2 isoform 2
Type:
Enzyme Catalytic Domain
Mol. Mass.:
81401.89
Organism:
Homo sapiens (Human)
Description:
Q9Y618-2 gi_116256445
Residue:
766
  
Inhibitor
Name:
BDBM66200
Synonyms:
2-(3,4-dichlorophenyl)-3-(5-methylfuran-2-yl)carbonyl-4-oxidanyl-1-(pyridin-3-ylmethyl)-2H-pyrrol-5-one 2-(3,4-dichlorophenyl)-4-hydroxy-3-[(5-methyl-2-furanyl)-oxomethyl]-1-(3-pyridinylmethyl)-2H-pyrrol-5-one MLS001031527 cid_2913046
Type:
Small organic molecule
Emp. Form.:
C22H16Cl2N2O4
Mol. Mass.:
443.279
SMILES:
Cc1ccc(o1)C(=O)C1C(N(Cc2cccnc2)C(=O)C1=O)c1ccc(Cl)c(Cl)c1
: