Target
Bcl-2-like protein 11
Ligand
BDBM66475
Substrate
Meas. Tech.
Luminescence Cell-Based Dose Retest to Identify Inhibitors of A1 Apoptosis
EC50
>350000±n/a nM
Citation
 PubChem, PC Luminescence Cell-Based Dose Retest to Identify Inhibitors of A1 Apoptosis PubChem Bioassay (2010)[AID] 
Target
Name:
Bcl-2-like protein 11
Synonyms:
B2L11_HUMAN BCL2L11 | BIM
Type:
PROTEIN
Mol. Mass.:
22175.26
Organism:
Homo sapiens (Human)
Description:
EBI_101325
Residue:
198
  
Inhibitor
Name:
BDBM66475
Synonyms:
5,6,7,8-tetrahydro-4H-cyclohepta[b]thiophene-2-carboxylic acid (1-allophanoyl-2-methyl-propyl) ester MLS000417714 [1-(aminocarbonylamino)-3-methyl-1-oxidanylidene-butan-2-yl] 5,6,7,8-tetrahydro-4H-cyclohepta[b]thiophene-2-carboxylate cid_4883633
Type:
Small organic molecule
Emp. Form.:
C16H22N2O4S
Mol. Mass.:
338.422
SMILES:
CC(C)C(OC(=O)c1cc2CCCCCc2s1)C(=O)NC(N)=O
: