Target
Signal transducer and activator of transcription 1-alpha/beta
Ligand
BDBM67107
Substrate
Meas. Tech.
Late stage results from the probe development effort to identify STAT1 inhibitors: luminescence-based cell-based dose response assay for STAT1 inhibitors
IC50
>55690±n/a nM
Citation
 PubChem, PC Late stage results from the probe development effort to identify STAT1 inhibitors: luminescence-based cell-based dose response assay for STAT1 inhibitors PubChem Bioassay (2010)[AID] 
Target
Name:
Signal transducer and activator of transcription 1-alpha/beta
Synonyms:
STAT1 Signal transducer and activator of transcription 1-alpha/beta Transcription factor ISGF-3 components p91/p84 | signal transducer and activator of transcription 1 isoform alpha
Type:
Cytosolic Transcription Factor
Mol. Mass.:
87327.69
Organism:
Homo sapiens (Human)
Description:
Stat1 was expressed in sf9 cells from a baculovirus encoding the recombinant proteins. Stat1 dimer binds to DNA.
Residue:
750
  
Inhibitor
Name:
BDBM67107
Synonyms:
N-(2-ethoxyphenyl)-2-phenyl-2-[4-(2,3,4-trifluorophenyl)sulfonyl-1-piperazinyl]acetamide N-(2-ethoxyphenyl)-2-phenyl-2-[4-[2,3,4-tris(fluoranyl)phenyl]sulfonylpiperazin-1-yl]ethanamide SR-03000000776-1 | cid_4840183
Type:
Small organic molecule
Emp. Form.:
C26H26F3N3O4S
Mol. Mass.:
533.563
SMILES:
CCOc1ccccc1NC(=O)C(N1CCN(CC1)S(=O)(=O)c1ccc(F)c(F)c1F)c1ccccc1
: