Target
Apelin receptor
Ligand
BDBM40988
Substrate
Meas. Tech.
Dose Response confirmation of uHTS hits from a small molecule antagonists of the APJ receptor via a luminescent beta-arrestin assay
IC50
>40000±n/a nM
Citation
 PubChem, PC Dose Response confirmation of uHTS hits from a small molecule antagonists of the APJ receptor via a luminescent beta-arrestin assay PubChem Bioassay (2010)[AID] 
Target
Name:
Apelin receptor
Synonyms:
AGTRL1 APJ_HUMAN Angiotensin receptor-like 1 Apelin receptor (APJ) G-protein coupled receptor HG11
Type:
Enzyme Catalytic Domain
Mol. Mass.:
42664.06
Organism:
Homo sapiens (Human)
Description:
P35414
Residue:
380
  
Inhibitor
Name:
BDBM40988
Synonyms:
2-ethoxyethyl 2-methyl-5-oxidanylidene-7-thiophen-2-yl-4-thiophen-3-yl-4,6,7,8-tetrahydro-1H-quinoline-3-carboxylate 2-methyl-5-oxo-7-thiophen-2-yl-4-(3-thiophenyl)-4,6,7,8-tetrahydro-1H-quinoline-3-carboxylic acid 2-ethoxyethyl ester MLS000112765 cid_2917230
Type:
Small organic molecule
Emp. Form.:
C23H25NO4S2
Mol. Mass.:
443.579
SMILES:
CCOCCOC(=O)C1C(c2ccsc2)C2=C(CC(CC2=O)c2cccs2)N=C1C
: