Target
Apelin receptor
Ligand
BDBM67194
Substrate
Meas. Tech.
Dose Response confirmation of uHTS hits from a small molecule antagonists of the APJ receptor via a luminescent beta-arrestin assay
IC50
3140±n/a nM
Citation
 PubChem, PC Dose Response confirmation of uHTS hits from a small molecule antagonists of the APJ receptor via a luminescent beta-arrestin assay PubChem Bioassay (2010)[AID] 
Target
Name:
Apelin receptor
Synonyms:
AGTRL1 APJ_HUMAN Angiotensin receptor-like 1 Apelin receptor (APJ) G-protein coupled receptor HG11
Type:
Enzyme Catalytic Domain
Mol. Mass.:
42664.06
Organism:
Homo sapiens (Human)
Description:
P35414
Residue:
380
  
Inhibitor
Name:
BDBM67194
Synonyms:
2-(4-Bromo-phenylamino)-1-p-tolyl-ethanone 2-(4-bromoanilino)-1-(p-tolyl)ethanone MLS000551990 cid_788612
Type:
Small organic molecule
Emp. Form.:
C15H14BrNO
Mol. Mass.:
304.182
SMILES:
Cc1ccc(cc1)C(=O)CNc1ccc(Br)cc1
: