Target
Nucleotide-binding oligomerization domain-containing protein 1
Ligand
BDBM65732
Substrate
Meas. Tech.
SAR analysis of compounds that inhibit NOD1 - Set 3
IC50
>20000±n/a nM
Citation
 PubChem, PC SAR analysis of compounds that inhibit NOD1 - Set 3 PubChem Bioassay (2010)[AID] 
Target
Name:
Nucleotide-binding oligomerization domain-containing protein 1
Synonyms:
CARD4 NOD1_HUMAN | nucleotide-binding oligomerization domain containing 1
Type:
Enzyme Catalytic Domain
Mol. Mass.:
107699.03
Organism:
Homo sapiens (Human)
Description:
gi_5174617
Residue:
953
  
Inhibitor
Name:
BDBM65732
Synonyms:
7-(2-methoxyethyl)-3-methyl-8-(3-phenylpropylsulfanyl)purine-2,6-dione 7-(2-methoxyethyl)-3-methyl-8-(3-phenylpropylthio)xanthine cid_652751
Type:
Small organic molecule
Emp. Form.:
C18H22N4O3S
Mol. Mass.:
374.457
SMILES:
COCCn1c(SCCCc2ccccc2)nc2n(C)c(=O)[nH]c(=O)c12
: