Target
Nucleotide-binding oligomerization domain-containing protein 2
Ligand
BDBM65736
Substrate
Meas. Tech.
SAR analysis of compounds that inhibit NOD2 - Set 3
IC50
>20000±n/a nM
Citation
 PubChem, PC SAR analysis of compounds that inhibit NOD2 - Set 3 PubChem Bioassay (2010)[AID] 
Target
Name:
Nucleotide-binding oligomerization domain-containing protein 2
Synonyms:
CARD15 IBD1 NOD2 Nucleotide-binding oligomerization domain-containing protein 2 | nucleotide-binding oligomerization domain containing 2
Type:
PROTEIN
Mol. Mass.:
115287.18
Organism:
Homo sapiens (Human)
Description:
ChEMBL_1454053
Residue:
1040
  
Inhibitor
Name:
BDBM65736
Synonyms:
7-[(E)-but-2-enyl]-8-[(4-chlorobenzyl)thio]-3-methyl-xanthine 7-[(E)-but-2-enyl]-8-[(4-chlorophenyl)methylsulfanyl]-3-methylpurine-2,6-dione MLS-0018272.0001 | cid_5761205
Type:
Small organic molecule
Emp. Form.:
C17H17ClN4O2S
Mol. Mass.:
376.86
SMILES:
C\C=C\Cn1c(SCc2ccc(Cl)cc2)nc2n(C)c(=O)[nH]c(=O)c12
: