Target
Tumor necrosis factor
Ligand
BDBM49106
Substrate
Meas. Tech.
SAR analysis of inhibitors of TNFa specific NF-kB induction - Set 3
IC50
18600±n/a nM
Citation
 PubChem, PC SAR analysis of inhibitors of TNFa specific NF-kB induction - Set 3 PubChem Bioassay (2010)[AID] 
Target
Name:
Tumor necrosis factor
Synonyms:
Cachectin TNF-a TNFA TNFSF2 Tumor necrosis factor (TNFa) Tumor necrosis factor ligand superfamily member 2 Tumor necrosis factor, soluble form | tumor necrosis factor alpha
Type:
Enzyme
Mol. Mass.:
25645.11
Organism:
Homo sapiens (Human)
Description:
P01375
Residue:
233
  
Inhibitor
Name:
BDBM49106
Synonyms:
7-[(E)-but-2-enyl]-3-methyl-8-(3-phenylpropylsulfanyl)purine-2,6-dione 7-[(E)-but-2-enyl]-3-methyl-8-(3-phenylpropylthio)xanthine SMR000015484 | cid_5310346
Type:
Small organic molecule
Emp. Form.:
C19H22N4O2S
Mol. Mass.:
370.469
SMILES:
C\C=C\Cn1c(SCCCc2ccccc2)nc2n(C)c(=O)[nH]c(=O)c12
: