Target
Tumor necrosis factor
Ligand
BDBM65734
Substrate
Meas. Tech.
SAR analysis of inhibitors of TNFa specific NF-kB induction - Set 3
IC50
>20000±n/a nM
Citation
 PubChem, PC SAR analysis of inhibitors of TNFa specific NF-kB induction - Set 3 PubChem Bioassay (2010)[AID] 
Target
Name:
Tumor necrosis factor
Synonyms:
Cachectin TNF-a TNFA TNFSF2 Tumor necrosis factor (TNFa) Tumor necrosis factor ligand superfamily member 2 Tumor necrosis factor, soluble form | tumor necrosis factor alpha
Type:
Enzyme
Mol. Mass.:
25645.11
Organism:
Homo sapiens (Human)
Description:
P01375
Residue:
233
  
Inhibitor
Name:
BDBM65734
Synonyms:
3-methyl-8-(3-phenylpropylsulfanyl)-7-prop-2-enyl-purine-2,6-dione 3-methyl-8-(3-phenylpropylthio)-7-prop-2-enylpurine-2,6-dione MLS-0061481.0001 | cid_2989653
Type:
Small organic molecule
Emp. Form.:
C18H20N4O2S
Mol. Mass.:
356.442
SMILES:
Cn1c2nc(SCCCc3ccccc3)n(CC=C)c2c(=O)[nH]c1=O
: