Target
Tumor necrosis factor
Ligand
BDBM65735
Substrate
Meas. Tech.
SAR analysis of inhibitors of TNFa specific NF-kB induction - Set 3
IC50
3350±n/a nM
Citation
 PubChem, PC SAR analysis of inhibitors of TNFa specific NF-kB induction - Set 3 PubChem Bioassay (2010)[AID] 
Target
Name:
Tumor necrosis factor
Synonyms:
Cachectin TNF-a TNFA TNFSF2 Tumor necrosis factor (TNFa) Tumor necrosis factor ligand superfamily member 2 Tumor necrosis factor, soluble form | tumor necrosis factor alpha
Type:
Enzyme
Mol. Mass.:
25645.11
Organism:
Homo sapiens (Human)
Description:
P01375
Residue:
233
  
Inhibitor
Name:
BDBM65735
Synonyms:
7-butyl-8-[[4-(3-chlorophenyl)-1-piperazinyl]methyl]-1,3-dimethylpurine-2,6-dione 7-butyl-8-[[4-(3-chlorophenyl)piperazin-1-yl]methyl]-1,3-dimethylpurine-2,6-dione MLS-0004183.0001 | cid_666267
Type:
Small organic molecule
Emp. Form.:
C22H29ClN6O2
Mol. Mass.:
444.958
SMILES:
CCCCn1c(CN2CCN(CC2)c2cccc(Cl)c2)nc2n(C)c(=O)n(C)c(=O)c12
: