Target
NADPH oxidase 1
Ligand
BDBM67510
Substrate
Meas. Tech.
Late-stage luminescence-based cell-based dose response assay to identify inhibitors of NADPH oxidase 1 (NOX1): Purchased analogs
IC50
>17000±n/a nM
Citation
 PubChem, PC Late-stage luminescence-based cell-based dose response assay to identify inhibitors of NADPH oxidase 1 (NOX1): Purchased analogs PubChem Bioassay (2010)[AID] 
Target
Name:
NADPH oxidase 1
Synonyms:
MOX-1 Mitogenic oxidase 1 NOH-1 NOX-1 NOX1_HUMAN
Type:
PROTEIN
Mol. Mass.:
64890.44
Organism:
Homo sapiens (Human)
Description:
ChEMBL_792877
Residue:
564
  
Inhibitor
Name:
BDBM67510
Synonyms:
(4-methoxyphenyl) 3-chloranyl-1-benzothiophene-2-carboxylate 3-chloro-1-benzothiophene-2-carboxylic acid (4-methoxyphenyl) ester SR-03000000732-1 | cid_833507
Type:
Small organic molecule
Emp. Form.:
C16H11ClO3S
Mol. Mass.:
318.775
SMILES:
COc1ccc(OC(=O)c2sc3ccccc3c2Cl)cc1
: