Target
Serine/threonine-protein kinase 33
Ligand
BDBM67629
Substrate
Meas. Tech.
Luminescence Cell-Free Homogenous Dose Retest to Identify Inhibitors of Serine/Threonine Kinase 33 Activity
EC50
25020±n/a nM
Citation
 PubChem, PC Luminescence Cell-Free Homogenous Dose Retest to Identify Inhibitors of Serine/Threonine Kinase 33 Activity PubChem Bioassay (2010)[AID] 
Target
Name:
Serine/threonine-protein kinase 33
Synonyms:
STK33 Serine/threonine-protein kinase 33
Type:
Enzyme Catalytic Domain
Mol. Mass.:
57833.21
Organism:
Homo sapiens (Human)
Description:
gi_23943882
Residue:
514
  
Inhibitor
Name:
BDBM67629
Synonyms:
3-tert-butyl-3aH-indeno[1,2-c]pyrazol-4-one SMR000528110 | cid_223899
Type:
Small organic molecule
Emp. Form.:
C14H14N2O
Mol. Mass.:
226.2738
SMILES:
CC(C)(C)c1[nH]nc2-c3ccccc3C(=O)c12
: