Target
Serine/threonine-protein kinase 33
Ligand
BDBM67648
Substrate
Meas. Tech.
Luminescence Cell-Free Homogenous Dose Retest to Identify Inhibitors of Serine/Threonine Kinase 33 Activity
EC50
59550±n/a nM
Citation
 PubChem, PC Luminescence Cell-Free Homogenous Dose Retest to Identify Inhibitors of Serine/Threonine Kinase 33 Activity PubChem Bioassay (2010)[AID] 
Target
Name:
Serine/threonine-protein kinase 33
Synonyms:
STK33 Serine/threonine-protein kinase 33
Type:
Enzyme Catalytic Domain
Mol. Mass.:
57833.21
Organism:
Homo sapiens (Human)
Description:
gi_23943882
Residue:
514
  
Inhibitor
Name:
BDBM67648
Synonyms:
2-[[3-[(2-carboxyphenyl)carbamoyl]benzoyl]amino]benzoic acid 2-[[[3-[(2-carboxyanilino)-oxomethyl]phenyl]-oxomethyl]amino]benzoic acid SMR000514034 cid_1070152
Type:
Small organic molecule
Emp. Form.:
C22H16N2O6
Mol. Mass.:
404.3722
SMILES:
OC(=O)c1ccccc1NC(=O)c1cccc(c1)C(=O)Nc1ccccc1C(O)=O
: