Target
DNA damage-inducible transcript 3 protein
Ligand
BDBM66392
Substrate
Meas. Tech.
Dose-response primary assay and counterscreen assay for HTS small molecule inhibitors of CHOP to regulate the unfolded protein response to ER stress
IC50
>10000±n/a nM
Citation
 PubChem, PC Dose-response primary assay and counterscreen assay for HTS small molecule inhibitors of CHOP to regulate the unfolded protein response to ER stress PubChem Bioassay (2010)[AID] 
Target
Name:
DNA damage-inducible transcript 3 protein
Synonyms:
Chop DDIT3_MOUSE Gadd153
Type:
Enzyme Catalytic Domain
Mol. Mass.:
19175.17
Organism:
Mus musculus
Description:
gi_160707929
Residue:
168
  
Inhibitor
Name:
BDBM66392
Synonyms:
2,2-bis(4-methylphenyl)-N-(4-nitro-2-oxidanyl-phenyl)cyclopropane-1-carboxamide N-(2-hydroxy-4-nitro-phenyl)-2,2-bis(p-tolyl)cyclopropanecarboxamide N-(2-hydroxy-4-nitrophenyl)-2,2-bis(4-methylphenyl)cyclopropane-1-carboxamide SMR000186615 | cid_3375236
Type:
Small organic molecule
Emp. Form.:
C24H22N2O4
Mol. Mass.:
402.4425
SMILES:
Cc1ccc(cc1)C1(CC1C(=O)Nc1ccc(cc1O)[N+]([O-])=O)c1ccc(C)cc1
: