Target
DNA damage-inducible transcript 3 protein
Ligand
BDBM63397
Substrate
Meas. Tech.
Dose-response primary assay and counterscreen assay for HTS small molecule inhibitors of CHOP to regulate the unfolded protein response to ER stress
IC50
3800±n/a nM
Citation
 PubChem, PC Dose-response primary assay and counterscreen assay for HTS small molecule inhibitors of CHOP to regulate the unfolded protein response to ER stress PubChem Bioassay (2010)[AID] 
Target
Name:
DNA damage-inducible transcript 3 protein
Synonyms:
Chop DDIT3_MOUSE Gadd153
Type:
Enzyme Catalytic Domain
Mol. Mass.:
19175.17
Organism:
Mus musculus
Description:
gi_160707929
Residue:
168
  
Inhibitor
Name:
BDBM63397
Synonyms:
MLS000723546 cid_5833488 | ethyl (2Z)-2-(9H-indeno[1,2-b][1,2,5]oxadiazolo[3,4-e]pyrazin-9-ylidene)hydrazinecarboxylate
Type:
Small organic molecule
Emp. Form.:
C14H10N6O3
Mol. Mass.:
310.2676
SMILES:
CCOC(=O)N\N=C1\c2ccccc2-c2nc3nonc3nc12
: