Target
Cannabinoid receptor 2
Ligand
BDBM68305
Substrate
Meas. Tech.
SAR analysis of antagonists of the Cannabinoid Receptor 2 using an Image-Based Assay - Set 2
IC50
>32000±n/a nM
Citation
 PubChem, PC SAR analysis of antagonists of the Cannabinoid Receptor 2 using an Image-Based Assay - Set 2 PubChem Bioassay (2010)[AID] 
Target
Name:
Cannabinoid receptor 2
Synonyms:
CANNABINOID CB2 CB2 CB2B CNR2_HUMAN Cannabinoid CB2 receptor Cannabinoid receptor 2 (CB2R) | hCB2
Type:
G Protein-Coupled Receptor (GPCR)
Mol. Mass.:
39690.94
Organism:
Homo sapiens (Human)
Description:
P34972
Residue:
360
  
Inhibitor
Name:
BDBM68305
Synonyms:
2-[(5-methyl-[1,2,4]triazolo[4,3-a]quinolin-1-yl)thio]-N-[4-(p-tolyl)thiazol-2-yl]acetamide N-[4-(4-methylphenyl)-1,3-thiazol-2-yl]-2-[(5-methyl-[1,2,4]triazolo[4,3-a]quinolin-1-yl)sulfanyl]acetamide N-[4-(4-methylphenyl)-2-thiazolyl]-2-[(5-methyl-[1,2,4]triazolo[4,3-a]quinolin-1-yl)thio]acetamide | cid_16253428
Type:
Small organic molecule
Emp. Form.:
C23H19N5OS2
Mol. Mass.:
445.56
SMILES:
Cc1ccc(cc1)-c1csc(NC(=O)CSc2nnc3cc(C)c4ccccc4n23)n1
: