Target
G-protein coupled receptor 35
Ligand
BDBM68328
Substrate
Meas. Tech.
SAR analysis of Agonists of the GPR35 Receptor using an Image-Based Assay - Set 3
EC50
>32000±n/a nM
Citation
 PubChem, PC SAR analysis of Agonists of the GPR35 Receptor using an Image-Based Assay - Set 3 PubChem Bioassay (2010)[AID] 
Target
Name:
G-protein coupled receptor 35
Synonyms:
G protein-coupled receptor 35 GPR35_HUMAN
Type:
Enzyme Catalytic Domain
Mol. Mass.:
34085.57
Organism:
Homo sapiens (Human)
Description:
gi_33695097
Residue:
309
  
Inhibitor
Name:
BDBM68328
Synonyms:
2-[(7-methoxy-4-methyl-[1,2,4]triazolo[4,3-a]quinolin-1-yl)sulfanyl]-N-(4-methyl-1,3-thiazol-2-yl)acetamide 2-[(7-methoxy-4-methyl-[1,2,4]triazolo[4,3-a]quinolin-1-yl)thio]-N-(4-methyl-2-thiazolyl)acetamide MLS-0435560.0001 | cid_1135732
Type:
Small organic molecule
Emp. Form.:
C18H17N5O2S2
Mol. Mass.:
399.49
SMILES:
COc1ccc2c(cc(C)c3nnc(SCC(=O)Nc4nc(C)cs4)n23)c1
: