Target
Cannabinoid receptor 2
Ligand
BDBM61131
Substrate
Meas. Tech.
SAR analysis of agonists of the Cannabinoid Receptor 2 using an Image-Based Assay - Set 2
EC50
>32000±n/a nM
Citation
 PubChem, PC SAR analysis of agonists of the Cannabinoid Receptor 2 using an Image-Based Assay - Set 2 PubChem Bioassay (2010)[AID] 
Target
Name:
Cannabinoid receptor 2
Synonyms:
CANNABINOID CB2 CB2 CB2B CNR2_HUMAN Cannabinoid CB2 receptor Cannabinoid receptor 2 (CB2R) | hCB2
Type:
G Protein-Coupled Receptor (GPCR)
Mol. Mass.:
39690.94
Organism:
Homo sapiens (Human)
Description:
P34972
Residue:
360
  
Inhibitor
Name:
BDBM61131
Synonyms:
1-(4-amino-1,2,5-oxadiazol-3-yl)-5-[(dipropylamino)methyl]-N'-[(Z)-3-indolylidenemethyl]-4-triazolecarbohydrazide 1-(4-aminofurazan-3-yl)-5-[(dipropylamino)methyl]-N'-[(Z)-indol-3-ylidenemethyl]triazole-4-carbohydrazide MLS000923831 cid_24789556
Type:
Small organic molecule
Emp. Form.:
C21H26N10O2
Mol. Mass.:
450.4969
SMILES:
CCCN(CCC)Cc1c(nnn1-c1nonc1N)C(=O)NN=Cc1c[nH]c2ccccc12
: