Target
Cannabinoid receptor 2
Ligand
BDBM68323
Substrate
Meas. Tech.
SAR analysis of agonists of the Cannabinoid Receptor 2 using an Image-Based Assay - Set 2
EC50
>32000±n/a nM
Citation
 PubChem, PC SAR analysis of agonists of the Cannabinoid Receptor 2 using an Image-Based Assay - Set 2 PubChem Bioassay (2010)[AID] 
Target
Name:
Cannabinoid receptor 2
Synonyms:
CANNABINOID CB2 CB2 CB2B CNR2_HUMAN Cannabinoid CB2 receptor Cannabinoid receptor 2 (CB2R) | hCB2
Type:
G Protein-Coupled Receptor (GPCR)
Mol. Mass.:
39690.94
Organism:
Homo sapiens (Human)
Description:
P34972
Residue:
360
  
Inhibitor
Name:
BDBM68323
Synonyms:
2-[(4,8-dimethyl-[1,2,4]triazolo[4,3-a]quinolin-1-yl)sulfanyl]-N-methyl-N-(4-phenyl-1,3-thiazol-2-yl)acetamide 2-[(4,8-dimethyl-[1,2,4]triazolo[4,3-a]quinolin-1-yl)thio]-N-methyl-N-(4-phenyl-2-thiazolyl)acetamide MLS-0435553.0001 | cid_1153409
Type:
Small organic molecule
Emp. Form.:
C24H21N5OS2
Mol. Mass.:
459.586
SMILES:
CN(C(=O)CSc1nnc2c(C)cc3ccc(C)cc3n12)c1nc(cs1)-c1ccccc1
: