Target
Cannabinoid receptor 1
Ligand
BDBM68318
Substrate
Meas. Tech.
SAR analysis of antagonists of the Cannabinoid Receptor 1 using an Image-Based Assay - Set 3
IC50
4980±n/a nM
Citation
 PubChem, PC SAR analysis of antagonists of the Cannabinoid Receptor 1 using an Image-Based Assay - Set 3 PubChem Bioassay (2010)[AID] 
Target
Name:
Cannabinoid receptor 1
Synonyms:
CANN6 CB-R CNR CNR1_HUMAN Cannabinoid receptor Cannabinoid receptor 1 (brain)
Type:
G Protein-Coupled Receptor (GPCR)
Mol. Mass.:
52868.96
Organism:
Homo sapiens (Human)
Description:
P21554
Residue:
472
  
Inhibitor
Name:
BDBM68318
Synonyms:
MLS-0401659.0001 N-(2-ethoxy-5-morpholin-4-ylsulfonylphenyl)-4-(2-oxopyrrolidin-1-yl)benzamide N-[2-ethoxy-5-(4-morpholinylsulfonyl)phenyl]-4-(2-oxo-1-pyrrolidinyl)benzamide | cid_24978834
Type:
Small organic molecule
Emp. Form.:
C23H27N3O6S
Mol. Mass.:
473.542
SMILES:
CCOc1ccc(cc1NC(=O)c1ccc(cc1)N1CCCC1=O)S(=O)(=O)N1CCOCC1
: