Target
Glycogen synthase kinase-3 beta
Ligand
BDBM68577
Substrate
Meas. Tech.
Luminescence Cell-Free Homogeneous Dose Retest to Identify Inhibitors of Glycogen Synthase Kinase-3 beta Activity
EC50
>300000±n/a nM
Citation
 PubChem, PC Luminescence Cell-Free Homogeneous Dose Retest to Identify Inhibitors of Glycogen Synthase Kinase-3 beta Activity PubChem Bioassay (2010)[AID] 
Target
Name:
Glycogen synthase kinase-3 beta
Synonyms:
GSK-3 beta GSK3B Glycogen synthase kinase 3 beta (GSK3B) Glycogen synthase kinase-3 beta (GSK-3B) Glycogen synthase kinase-3 beta (GSK3B) Glycogen synthase kinase-3beta (GSK3B) | Serine/threonine-protein kinase GSK3B
Type:
Enzyme
Mol. Mass.:
46756.38
Organism:
Homo sapiens (Human)
Description:
P49841
Residue:
420
  
Inhibitor
Name:
BDBM68577
Synonyms:
3-[3-(1-hydroxyethyl)anilino]-5,5-dimethyl-1-cyclohex-2-enone 3-[3-(1-hydroxyethyl)anilino]-5,5-dimethylcyclohex-2-en-1-one 3-{[3-(1-hydroxyethyl)phenyl]amino}-5,5-dimethyl-2-cyclohexen-1-one SMR000072588 | cid_2939403
Type:
Small organic molecule
Emp. Form.:
C16H21NO2
Mol. Mass.:
259.3434
SMILES:
CC(O)c1cccc(NC2=CC(=O)CC(C)(C)C2)c1
: