Target
Glycogen synthase kinase-3 beta
Ligand
BDBM68619
Substrate
Meas. Tech.
Luminescence Cell-Free Homogeneous Dose Retest to Identify Inhibitors of Glycogen Synthase Kinase-3 beta Activity
EC50
>300000±n/a nM
Citation
 PubChem, PC Luminescence Cell-Free Homogeneous Dose Retest to Identify Inhibitors of Glycogen Synthase Kinase-3 beta Activity PubChem Bioassay (2010)[AID] 
Target
Name:
Glycogen synthase kinase-3 beta
Synonyms:
GSK-3 beta GSK3B Glycogen synthase kinase 3 beta (GSK3B) Glycogen synthase kinase-3 beta (GSK-3B) Glycogen synthase kinase-3 beta (GSK3B) Glycogen synthase kinase-3beta (GSK3B) | Serine/threonine-protein kinase GSK3B
Type:
Enzyme
Mol. Mass.:
46756.38
Organism:
Homo sapiens (Human)
Description:
P49841
Residue:
420
  
Inhibitor
Name:
BDBM68619
Synonyms:
3-[[3-(4-fluorophenyl)-[1,2,4]triazolo[4,3-b]pyridazin-6-yl]sulfanyl]pentane-2,4-dione MLS000102605 cid_5310354
Type:
Small organic molecule
Emp. Form.:
C16H13FN4O2S
Mol. Mass.:
344.363
SMILES:
CC(=O)C(Sc1ccc2nnc(-c3ccc(F)cc3)n2n1)C(C)=O
: