Target
Krueppel-like factor 5
Ligand
BDBM70225
Substrate
Meas. Tech.
Late stage results from the probe development effort to identify inhibitors of kruppel-like factor 5 (KLF5): luminescence-based cell-based dose response assay for inhibitors of KLF5 (Round 1)
IC50
7965±n/a nM
Citation
 PubChem, PC Late stage results from the probe development effort to identify inhibitors of kruppel-like factor 5 (KLF5): luminescence-based cell-based dose response assay for inhibitors of KLF5 (Round 1) PubChem Bioassay (2010)[AID] 
Target
Name:
Krueppel-like factor 5
Synonyms:
BTEB2 IKLF KLF5_HUMAN | Kruppel-like factor 5
Type:
Enzyme Catalytic Domain
Mol. Mass.:
50808.71
Organism:
Homo sapiens (Human)
Description:
Q13887
Residue:
457
  
Inhibitor
Name:
BDBM70225
Synonyms:
N-(6-chloranyl-2-phenyl-benzotriazol-5-yl)-2-phenyl-ethanamide N-(6-chloro-2-phenyl-benzotriazol-5-yl)-2-phenyl-acetamide SR-03000001356 cid_1305859
Type:
Small organic molecule
Emp. Form.:
C20H15ClN4O
Mol. Mass.:
362.812
SMILES:
Clc1cc2nn(nc2cc1NC(=O)Cc1ccccc1)-c1ccccc1
: