Target
Envelope glycoprotein gp160
Ligand
BDBM70233
Substrate
Meas. Tech.
SAR analysis of compounds that inhibit Human Immunodeficiency Virus Fusion.
IC50
14500±n/a nM
Citation
 PubChem, PC SAR analysis of compounds that inhibit Human Immunodeficiency Virus Fusion. PubChem Bioassay (2010)[AID] 
Target
Name:
Envelope glycoprotein gp160
Synonyms:
envelope glycoprotein
Type:
Enzyme Catalytic Domain
Mol. Mass.:
91798.58
Organism:
Human immunodeficiency virus 1
Description:
gi_45357394
Residue:
814
  
Inhibitor
Name:
BDBM70233
Synonyms:
3-bromanyl-5,7-dinitro-2-phenyl-1-benzofuran-4-ol 3-bromo-5,7-dinitro-2-phenyl-4-benzofuranol MLS-0330965.0001 | cid_2265220
Type:
Small organic molecule
Emp. Form.:
C14H7BrN2O6
Mol. Mass.:
379.119
SMILES:
Oc1c(cc([N+]([O-])=O)c2oc(c(Br)c12)-c1ccccc1)[N+]([O-])=O
: