Target
Envelope glycoprotein gp160
Ligand
BDBM53960
Substrate
Meas. Tech.
SAR analysis of compounds that inhibit Human Immunodeficiency Virus Fusion.
IC50
9040±n/a nM
Citation
 PubChem, PC SAR analysis of compounds that inhibit Human Immunodeficiency Virus Fusion. PubChem Bioassay (2010)[AID] 
Target
Name:
Envelope glycoprotein gp160
Synonyms:
envelope glycoprotein
Type:
Enzyme Catalytic Domain
Mol. Mass.:
91798.58
Organism:
Human immunodeficiency virus 1
Description:
gi_45357394
Residue:
814
  
Inhibitor
Name:
BDBM53960
Synonyms:
(5Z)-3-(2-chlorophenyl)-5-(4-hydroxy-3-methoxy-5-nitro-benzylidene)thiazolidine-2,4-quinone (5Z)-3-(2-chlorophenyl)-5-[(4-hydroxy-3-methoxy-5-nitrophenyl)methylidene]-1,3-thiazolidine-2,4-dione 3-(2-chlorophenyl)-5-(4-hydroxy-3-methoxy-5-nitrobenzylidene)-1,3-thiazolidine-2,4-dione SMR000299099 | cid_1311429
Type:
Small organic molecule
Emp. Form.:
C17H11ClN2O6S
Mol. Mass.:
406.797
SMILES:
COc1cc(\C=C2/SC(=O)N(C2=O)c2ccccc2Cl)cc(c1O)[N+]([O-])=O
: