Target
Envelope glycoprotein gp160
Ligand
BDBM70238
Substrate
Meas. Tech.
SAR analysis of compounds that inhibit Human Immunodeficiency Virus Fusion.
IC50
4320±n/a nM
Citation
 PubChem, PC SAR analysis of compounds that inhibit Human Immunodeficiency Virus Fusion. PubChem Bioassay (2010)[AID] 
Target
Name:
Envelope glycoprotein gp160
Synonyms:
envelope glycoprotein
Type:
Enzyme Catalytic Domain
Mol. Mass.:
91798.58
Organism:
Human immunodeficiency virus 1
Description:
gi_45357394
Residue:
814
  
Inhibitor
Name:
BDBM70238
Synonyms:
2-[(5Z)-5-(3-ethoxy-4-hydroxy-5-nitro-benzylidene)-2,4-diketo-thiazolidin-3-yl]-N-(2-fluorophenyl)acetamide 2-[(5Z)-5-[(3-ethoxy-4-hydroxy-5-nitrophenyl)methylidene]-2,4-dioxo-3-thiazolidinyl]-N-(2-fluorophenyl)acetamide MLS-0283960.0001 | cid_2243980
Type:
Small organic molecule
Emp. Form.:
C20H16FN3O7S
Mol. Mass.:
461.42
SMILES:
CCOc1cc(\C=C2/SC(=O)N(CC(=O)Nc3ccccc3F)C2=O)cc(c1O)[N+]([O-])=O
: